{"text_format":"1","workbook":"xlsx","n_sheets":3,"sheets":["ElencoAllievi","Corsi","FoglioFirme"],"not_rendered":{"charts":0,"images":0,"macros":1,"external_links":0,"defined_names":4,"comments":0,"pivot_tables":0},"unopened":[],"bounds":{"document_bytes":16777216,"sheet_cells":100000,"rows_first":2000,"rows_last":500,"rows_between":2000,"halvings":0,"cell_chars":16384,"cell_head_chars":4096},"cells_cut":0,"cells_raw":0,"read":"whole","date_system":"1900"}

{"sheet":"ElencoAllievi","index":0,"n_rows":126,"n_cols":22,"rows_kept":126,"cut":false,"hidden":false,"merged":[[9,0,10,0],[3,0,4,0],[7,0,8,0],[7,1,8,4],[9,1,10,4],[0,0,1,4],[4,8,5,11],[1,8,2,11],[6,10,6,11],[6,8,6,9],[3,1,4,4],[6,3,6,4],[5,3,5,4],[20,10,23,11],[8,8,10,11],[9,5,9,7],[7,8,7,9],[7,10,7,11]]}
["Corso di aggiornamento professionale per il mantenimento dell'iscrizione nell'Elenco Nazionale dei Tecnici Competenti in Acustica (ENTECA) - D.Lgs. 42/2017",null,null,null,null,null,null,null,"Indirizzo repertorio corsi:",null,null,null,"Ver. 2.2 30/11/2021",null,null,null,17,18,19,20,21,22]
[null,null,null,null,null,null,null,null,"https://agentifisici.isprambiente.it/enteca/corsi_aggiornamentolist.php?export=excel"]
["Cod. Corso",{"$f":"IF(LEN($F$101)=7,MID($F$101,2,6),\"\")","v":""},"Regione/Provincia autonoma","Campania"]
["Titolo:",{"$f":"IF(LEN($F$101)=7,IF(VALUE(MID(VLOOKUP($F$101,Corsi!$A:$T,8,FALSE),2,6))>0,MID(VLOOKUP($F$101,Corsi!$A:$T,8,FALSE),11,255),VLOOKUP($F$101,Corsi!$A:$T,8,FALSE)),\"\")","v":""},null,null,null,null,null,null,"Link alla Cartella dei file da inviare alla Regione/Provincia autonoma competente"]
[null,null,null,null,null,null,null,null,"F:\\_Ufficio\\_Desktop\\agg_Tca\\aggTca_Report"]
["Cod. Ente","Numero ore","Data avvio","Data fine"]
[{"$f":"IF(LEN($F$101)=7,MID(VLOOKUP($F$101,Corsi!$A:$T,4,FALSE),1,4),\"\")","v":""},{"$f":"IF(LEN($F$101)=7,VLOOKUP($F$101,Corsi!$A:$T,9,FALSE),\"\")","v":""},{"$f":"IF(LEN($F$101)=7,VLOOKUP($F$101,Corsi!$A:$T,10,FALSE),\"\")","v":""},{"$f":"IF(LEN($F$101)=7,VLOOKUP($F$101,Corsi!$A:$T,11,FALSE),\"\")","v":""},{"$f":"IF($B$3>\"\",IFERROR(VLOOKUP($F$101,Corsi!$A:$T,10,FALSE),\"\"),\"\")","v":""},null,null,null,"Secondi di attesa per pagine web (0-9)",null,0]
["Soggetto",{"$f":"IF(LEN($F$101)=7,MID(VLOOKUP($F$101,Corsi!$A:$T,4,FALSE),8,255),\"\")","v":""},null,null,null,null,null,null,"Ultimo aggiornamento Repertorio Corsi",null,"2021-11-30T19:53:28",null,null,null,null,null," "]
[]
["Sede Operativa",{"$f":"IF(LEN($F$101)=7,VLOOKUP($F$101,Corsi!$A:$T,16,FALSE) & \" \" & VLOOKUP($F$101,Corsi!$A:$T,15,FALSE) & \" \" & VLOOKUP(F101,Corsi!$A:$T,14,FALSE) & \" - \" & VLOOKUP(F101,Corsi!$A:$T,13,FALSE),\"\")","v":""},null,null,null,"aggTcaFormatInvioDati (version 1.0)"]
[]
["Num.","N. ENTECA","Cognome e Nome","Regione di residenza","A","N. ENTECA Docente","n. ore","tipo","Cognome e Nome Docente","Regione di residenza","Dalle","Alle",null,null,null,null,"Docenti","Ctrl","Allievi",null,"ctrlAllievi","crtlDocenti"]
[1,null,null,null,null,null,null,null,null,null,null,null,null,null,null,null,"Docente 1",null,"Allievo 1",null,"7137ANTONUCCI GIOVANNI","11603CAMBIAGGIO ANTONIO PIETRO"]
[2,null,null,null,null,null,null,null,null,null,null,null,null,null,null,null,"Docente 2",null,"Allievo 2",null,"8802ANTONUCCI GIOVANNI","4706KARROUM MICHEL"]
[3,null,null,null,null,null,null,null,null,null,null,null,null,null,null,null,"Docente 3",null,"Allievo 3",null,"8626AURINO GABRIELE","7535NOTINI CARLO"]
[4,null,null,null,null,null,null,null,null,null,null,null,null,null,null,null,"Docente 4",null,"Allievo 4",null,"1449BARBERINI LUCA","11405BELINGHERI ANDREA"]
[5,null,null,null,null,null,null,null,null,null,null,null,null,null,null,null,"Docente 5",null,"Allievo 5",null,"7151BARBONA SERGIO","4801NATALINI ENRICO"]
[6,null,null,null,null,null,null,null,null,null,null,null,null,null,null,null,"Docente 6",null,"Allievo 6",null,"9379BASILE GIOVANNI"]
[7,null,null,null,null,null,null,null,null,null,null,null,null,null,null,null,"Docente 7",null,"Allievo 7",null,"3BENINI IACOPO"]
[8,null,null,null,null,null,null,null,null,null,null,null,null,null,null,null,"Docente 8",null,"Allievo 8",null,"4408BERTELLINO FRANCO"]
[9,null,null,null,null,null,null,"D","= Docente iscritto in Enteca",null,"Valori NON obbigatori, se presenti saranno trasferiti nel foglio firme.",null,null,null,null,null,"ore Docente",null,"Allievo 9",null,"1489BETTINI VERONICA MARIAGATA"]
[10,null,null,null,null,"A = Assente",null,"P","= Docente/Professionista non iscritto in ENTECA",null,null,null,null,null,null,null,"ore Co-Docente",null,"Allievo 10",null,"594BONIOTTO EMILIANO"]
[11,null,null,null,null,"P = Presente",null,"C","= Co-Docente iscritto in ENTECA",null,null,null,null,null,null,null,null,null,"Allievo 11",null,"9393CACCAVALE GIORGIO"]
[12,null,null,null,null,null,null,"K","= Co-Docente/Professionista non iscritto in ENTECA",null,null,null,null,null,null,null,null,null,"Allievo 12",null,"5055CASADIO MICHELE"]
[13,null,null,null,null,null,null,null,null,null,null,null,null,null,null,null,null,null,"Allievo 13",null,"7248CECCHI STEFANO"]
[14,null,null,null,null,null,null,null,null,null,null,null,null,null,null,null,null,null,"Allievo 14",null,"9472COSTABILE GIUSEPPE"]
[15,null,null,null,null,null,null,null,null,null,null,null,null,null,null,null,null,null,"Allievo 15",null,"8962CUCCURULLO LUCA"]
[16,null,null,null,null,null,"",null,null,null,null,null,null,null,null,null,null,null,"Allievo 16",null,"6445CUCINELLA GAETANO"]
[17,null,null,null,null,null,"",null,null,null,null,null,null,null,null,null,null,null,"Allievo 17",null,"9007D'ORTA FRANCESCO"]
[18,null,null,null,null,null,"",null,null,null,null,null,null,null,null,null,null,null,"Allievo 18",null,"5331DEGLI ANGELI ILARIA"]
{"$rows_left_out":97}
{"sheet":"Corsi","index":1,"n_rows":939,"n_cols":17,"rows_kept":939,"cut":false,"hidden":true,"merged":[]}
["Key","Regione","Soggetto erogatore","Nome soggetto <br>erogatore","Telefono","Email","Dati contatto","Titolo","Ore di aggiornamento","Data avvio","Data fine","Modalità erogazione","Indirizzo","Provincia","Comune","Cap","Atto autorizzazione"]
[null,"Lombardia","Soggetto idoneo alla formazione","SCUOLA EDILE DI BERGAMO","035-297671","info@scuolaedilebg.it",null,"IL RUMORE DA CALPESTIO: PROGETTAZIONE, CONTROLLO E COLLAUDO",6,"12/12/2018","12/12/2018","Lezioni frontali","VIA ANTONIO LOCATELLI, N. 15","BG","Seriate",24068,"riscontro comunicazione AGG1.pdf"]
[null,"Puglia","Soggetto idoneo alla formazione","0001 - SON TRAINING SRLS",null,"sontraining@pec.it","Sede legale in via Tiratore n. 24 - 83042 Atripalda (AV)\nValerio d'Anna\ndanna@sontraining.it","X000001 - La valutazione di Impatto acustico anche alla luce della nuova norma UNI 12354- 4 \u0096 sviluppo di casi pratici",5,"28/01/2019","28/01/2019","Lezioni frontali","Ordine degli ingegneri di Bari - Via Japigia 184 \u0096 BARI","BA","Bari",70126,"DD. n. 201_15.11.2018.pdf"]
[null,"Puglia","Soggetto idoneo alla formazione","0001 - SON TRAINING SRLS",null,"sontraining@pec.it","Sede legale in via Tiratore n. 24 - 83042 Atripalda (AV)\nValerio d'Anna\ndanna@sontraining.it","X000002 - Calcolo dei Requisiti Acustici Passivi ai sensi delle nuove norme UNI sia in fase di  progetto che di collaudo \u0096 sviluppo di casi pratici",10,"11/02/2019","18/02/2019","Lezioni frontali","Ordine degli ingegneri di Bari - Via Japigia 184 \u0096 BARI","BA","Bari",70126,"DD. n. 201_15.11.2018(1).pdf"]
[null,"Puglia","Soggetto idoneo alla formazione","0001 - SON TRAINING SRLS",null,"sontraining@pec.it","Sede legale in VIA TIRATORE 24 \u0096 ATRIPALDA (AV) \nVALERIO D\u0092ANNA\ndanna@sontraining.it","X000003 - Misurazioni di rumore e di vibrazioni nei luoghi di lavoro \u0096 ultimi aggiornamenti  normativi e tecnici",10,"11/03/2019","18/03/2019","Lezioni frontali","Ordine degli ingegneri di Bari - Via Japigia 184 \u0096 BARI","BA","Bari",70126,"DD. n. 201_15.11.2018(2).pdf"]
[null,"Marche","Ordine professionale","Ordine ingegneri Ancona","071 2075392","segreteria@ordineingegneri.ancona.it","Segreteria","La valutazione dei requisiti acustici passivi con le nuove norme UNI EN ISO 12354-2017",10,"20/12/2018","21/12/2018","Lezioni frontali","Piazza del Plebiscito, 2","AN","Ancona",60121,"Dec. 99_2018.pdf"]
[null,"Marche","Ordine professionale","Ordine degli ingegneri della Provincia di Macerata","0733 233111","info@ordineingegnerimacerata.it","Segreteria","Le procedure amministrative in materia di acustica (Mod.1) - Acustica delle strutture leggere (Mod.2)",11,"15/02/2019","22/02/2019","Lezioni frontali","Via Famiglia Palmieri, 26","MC","Macerata",62100,"Decreto_121.2018.pdf"]
[null,"Marche","Soggetto idoneo alla formazione","The Acs Scuola Italiana di Alta Formazione Srl","071 4604348","info@theacs.it",null,"La valutazione dei requisiti acustici passivi con le nuove norme UNI EN ISO 12354-2017",12,"01/02/2019","15/02/2019","Lezioni frontali","Via Valle Piana, 80 - Aula The Acs c/o Centro Agroalimentare Piceno","AP","San Benedetto del Tronto",63074,"DDPF 1578_2018.docx.pdf"]
[null,"Marche","Ordine professionale","Ordine degli Ingegneri della Provincia di Pesaro-Urbino","0721 370079","info@ingegneripesarourbino.it","PEC: ordine.pesaro@ingpec.eu","La valutazione dei requisiti acustici passivi con le nuove norme UNI EN ISO 12354-2017",10,"15/03/2019","22/03/2019","Lezioni frontali","V.le Einaudi, 24 - Fano (PU) c/o Hotel TAG","PU","Fano",61032,"Dec. agg. Ingg. PU.pdf"]
["D000001","Campania","Soggetto idoneo alla formazione","0001 - Son Training S.r.l.s.",null,"formazione@sontraing.it",null,"D000001 - La valutazione di Impatto acustico anche alla luce della nuova norma UNI 12354-4 - sviluppo di casi pratici",5,"24/01/2019","24/01/2019","Lezioni frontali","Via Pontano, 6","NA","Nola",80035,"Atto Decreto GRC n.1  del 23.01.2019.pdf"]
["D000002","Campania","Soggetto idoneo alla formazione","0001 - Son Training S.r.l.s.",null,"formazione@sontraing.it",null,"D000002 - Misurazioni di rumore e di vibrazioni nei luoghi di lavoro - ultimi aggiornamenti normativi e tecnici",10,"05/02/2019","07/02/2019","Lezioni frontali","Via Pontano, 6","NA","Nola",80035,"Atto Decreto GRC n.1  del 23.01.2019(1).pdf"]
["D000003","Campania","Soggetto idoneo alla formazione","0001 - Son Training S.r.l.s.",null,"formazione@sontraing.it",null,"D000003 - Calcolo dei Requisiti Acustici Passivi ai sensi delle nuove norme UNI sia in fase di progetto che di collaudo - sviluppo di casi pratici",10,"05/03/2019","07/03/2019","Lezioni frontali","Via Pontano, 6","NA","Nola",80035,"Atto Decreto GRC n.1  del 23.01.2019(2).pdf"]
["D000004","Campania","Soggetto idoneo alla formazione","0001 - Son Training S.r.l.s.",null,"formazione@sontraing.it",null,"D000004 - Approfondimenti sulle metodologie di valutazione del criterio della normale tollerabilità e accettabilità - acustica forense",5,"31/05/2019","31/05/2019","Lezioni frontali","Via Pontano, 6","NA","Nola",80035,"Atto Decreto GRC n.1  del 23.01.2019(3).pdf"]
["D000005","Campania","Soggetto idoneo alla formazione","0001 - Son Training S.r.l.s.",null,"formazione@sontraing.it",null,"D000005 - Valutazione di impatto acustico di impianti eolici secondo le linee guida Ispra",5,"21/06/2019","21/06/2019","Lezioni frontali","Via Pontano, 6","NA","Nola",80035,"Atto Decreto GRC n.1  del 23.01.2019(4).pdf"]
["D000006","Campania","Soggetto idoneo alla formazione","0001 - Son Training S.r.l.s.",null,"formazione@sontraing.it",null,"D000006 - Autorizzazione in deroga per le attività temporanee - problematiche connesse alla movida - metodologie applicative",5,"21/05/2019","21/05/2019","Lezioni frontali","Via Pontano, 6","NA","Nola",80035,"Atto Decreto GRC n.1  del 23.01.2019(5).pdf"]
["D000007","Campania","Soggetto idoneo alla formazione","0001 - Son Training S.r.l.s.",null,"formazione@sontraing.it",null,"D000007 - Il confort acustico alla luce dei nuovi criteri ambientali minimi per gli edifici pubblici ai sensi del decreto del Ministero dell'Ambiente DECRETO 11 ottobre 2017",5,"12/09/2019","12/09/2019","Lezioni frontali","Via Pontano, 6","NA","Nola",80035,"Atto Decreto GRC n.1  del 23.01.2019(6).pdf"]
[null,"Lombardia","Soggetto idoneo alla formazione","TECO MILANO SRL","0248958304","info@tecomilano.it",null,"CORSO DI AGGIORNAMENTO PER TECNICI COMPETENTI IN ACUSTICA",12,"12/04/2019","13/04/2019","Lezioni frontali","c/o ASSOACUSTICI - CORSO ITALIA, N. 13 - SARONNO (VA)","VA","Saronno",21047,"riscontro comunicazione AGG2.pdf"]
[null,"Lombardia","Ordine professionale","ORDINE DEGLI INGEGNERI DELLA PROVINCIA DI BRESCIA","030-2294711","www.ordineingegneri.bs.it",null,"CORSO DI AGGIORNAMENTO PER TECNICI COMPETENTI IN ACUSTICA",4,"12/04/2019","12/04/2019","Lezioni frontali","Via Cefalonia, n. 70","BS","Brescia",25124,"riscontro comunicazione AGG3.pdf"]
[null,"Lombardia","Soggetto idoneo alla formazione","TECO MILANO SRL","02-48958304","info@tecomilano.it",null,"CORSO DI AGGIORNAMENTO PER TECNICI COMPETENTI IN ACUSTICA",12,"17/05/2019","18/05/2019","Lezioni frontali","c/o ASSOACUSTICI - CORSO ITALIA, N. 13 - SARONNO (VA)","VA","Saronno",21047,"riscontro comunicazione AGG4.pdf"]
[null,"Lombardia","Ordine professionale","ORDINE DEGLI INGEGNERI DELLA PROVINCIA DI COMO","031-269810","formazione@ordingcomo.org",null,"ACUSTICA NEL CICLO DI PROGETTO",8,"05/04/2019","05/04/2019","Lezioni frontali","VIA VOLTA, N. 62 COMO","CO","Como",22100,"DOC100419-10042019103307.pdf"]
[null,"Lombardia","Ordine professionale","ORDINE DEGLI INGEGNERI DELLA PROVINCIA DI COMO","031-269810","formazione@ordingcomo.org",null,"ACUSTICA PER INTERNI - COMFORT E DESIGN",8,"06/06/2019","06/06/2019","Lezioni frontali","VIA VOLTA, N. 62 COMO","CO","Como",22100,"riscontro comunicazione AGG6.pdf"]
[null,"Abruzzo","Soggetto idoneo alla formazione","Fondazione Architetti, Chieti-Pescara","085/693726","fondazione@architettichpe.it","Arch. Barbara Crescia","Tecnico Competente in Acustica Edilizia-Architettonica",8,"10/04/2019","17/04/2019","Lezioni frontali","Piazza Garibaldi, n.42","PE","Pescara",65127,"DPC025-98 del 19.03.2019.pdf"]
[null,"Abruzzo","Soggetto idoneo alla formazione","The ACS, Scuola Italiana Alta Formazione","071/4604348","info@theacs.it",null,"La Valutazione dei requisiti acustici passivi con le nuove norme UNI EN ISO 12354-2017",10,"29/03/2019","24/05/2019","Lezioni frontali","Via Spezioli n. 58","CH","Chieti",66100,"DPC025-99 del 19.03.19.pdf"]
[null,"Lombardia","Ordine professionale","ORDINE DEGLI INGEGNERI DELLA PROVINCIA DI COMO","031-269810","formazione@ordingcomo.org",null,"ACUSTICA EDILIZIA - CORSO AVANZATO",16,"26/09/2019","27/09/2019","Lezioni frontali","VIA VOLTA, N. 62 COMO","CO","Como",22100,"DOC240919-24092019085906.pdf.pdf"]
[null,"Lombardia","Ordine professionale","ORDINE DEGLI INGEGNERI DELLA PROVINCIA DI COMO","031-269810","formazione@ordingcomo.org",null,"ACUSTICA FORENSE",7,"23/05/2019","23/05/2019","Lezioni frontali","VIA VOLTA, N. 62 COMO","CO","Como",22100,"riscontro comunicazione AGG7.pdf"]
[null,"Lombardia","Ordine professionale","ORDINE DEGLI INGEGNERI DELLA PROVINCIA DI COMO","031-269810","formazione@ordingcomo.org",null,"STRUMENTAZIONI E TECNICHE DI MISURA - ESERCITAZIONI PRATICHE SULL'USO DEI FONOMETRI",7,"07/11/2019","07/11/2019","Lezioni frontali","VIA VOLTA, N. 62 COMO","CO","Como",22100,"riscontro comunicazione AGG9.pdf"]
[null,"Lombardia","Soggetto idoneo alla formazione","TECO MILANO SRL","02-48958304","info@tecomilano.it",null,"CORSO DI AGGIORNAMENTO PER TECNICI COMPETENTI IN ACUSTICA",12,"07/06/2019","08/06/2019","Lezioni frontali","c/o ASSOACUSTICI - CORSO ITALIA, N. 13 - SARONNO (VA)","VA","Saronno",21047,"riscontro comunicazione AGG10.pdf"]
[null,"Emilia Romagna","Soggetto idoneo alla formazione","ADDESTRA S.R.L.","0546 624965","lfiorini@addestra.it","Fiorini Loretta","Corsi di aggiornamento dei tecnici competenti in acustica. MISURAZIONI DI RUMORE E VIBRAZIONI NEI LUOGHI DI LAVORO. Rif. P.A. 2012-11008/RER - Edizione 1",5,"16/04/2019","16/04/2019","Lezioni frontali","VIA MENGOLINA 33","RA","Faenza",48018,"DD_3665_19(3).pdf"]
[null,"Emilia Romagna","Soggetto idoneo alla formazione","ISCOM FORMAZIONE PER LE IMPRESE Società Consortile arl","0547 639887","coordinatore1@iscomcesena.it","LOGGIA SERGIO","Percorso di aggiornamento per Tecnici in Acustica Ambientale. Modulo 1. Rif. P.A. 2012-11039/RER/1 - Edizione 1",10,"03/04/2019","17/04/2019","Lezioni frontali","Via G. Bruno, 118","FC","Cesena",47521,"DD_3665_19(4).pdf"]
[null,"Emilia Romagna","Soggetto idoneo alla formazione","Associazione Assform","051 0548820","segreteria@assform.it","Semprini Mario Paolo","Aggiornamento Tecnico Competente in Acustica - La normale tollerabilità alla luce dei nuovi dispositivi di legge. Rif. P.A. 2012-11123/RER/1 - Edizione 2",8,"05/06/2019","05/06/2019","Lezioni frontali","Via Garibaldi, 8 presso Hotel Continental","BO","Zola Predosa",40069,"DD_4996_2019.pdf"]
{"$rows_left_out":910}
{"sheet":"FoglioFirme","index":2,"n_rows":66,"n_cols":13,"rows_kept":66,"cut":false,"hidden":false,"merged":[[0,0,3,1],[63,0,64,12],[65,0,65,7],[57,9,57,10],[61,8,61,9],[61,10,61,12],[62,8,62,9],[62,10,62,12],[57,11,57,12],[51,9,51,10],[55,8,55,9],[55,10,55,12],[56,8,56,9],[56,10,56,12],[51,11,51,12],[45,9,45,10],[49,8,49,9],[49,10,49,12],[50,8,50,9],[50,10,50,12],[45,11,45,12],[47,8,47,12],[48,8,48,12],[46,9,46,12],[37,8,37,12],[43,8,43,9],[43,10,43,12],[44,8,44,9],[44,10,44,12],[38,9,38,10],[38,11,38,12],[39,9,39,12],[40,8,40,12],[41,8,41,12],[42,8,42,12],[33,0,36,1],[33,2,33,9],[34,6,36,9],[32,0,32,7],[30,0,31,12],[34,2,34,5],[35,2,36,5],[34,11,34,12],[0,2,0,9],[10,8,10,9],[10,10,10,12],[11,8,11,9],[5,11,5,12],[11,10,11,12],[4,8,4,12],[1,6,3,9],[5,9,5,10],[1,11,1,12],[1,2,1,5],[2,2,3,5],[6,9,6,12],[7,8,7,12],[8,8,8,12],[9,8,9,12],[16,10,16,12],[18,9,18,10],[12,9,12,10],[17,8,17,9],[17,10,17,12],[13,9,13,12],[14,8,14,12],[15,8,15,12],[12,11,12,12],[18,11,18,12],[16,8,16,9],[29,8,29,9],[29,10,29,12],[23,8,23,9],[28,10,28,12],[26,8,26,12],[27,8,27,12],[23,10,23,12],[24,9,24,10],[24,11,24,12],[19,9,19,12],[20,8,20,12],[21,8,21,12],[25,9,25,12],[28,8,28,9],[22,8,22,9],[22,10,22,12],[59,8,59,12],[60,8,60,12],[52,9,52,12],[53,8,53,12],[54,8,54,12],[58,9,58,12]]}
["Allegato 3\nLogo Ente",null,{"$f":"\"Corso di n. \" &  ElencoAllievi!$B$7 & \" ore di aggiornamento professionale per T.C.A. (Decreto Lgs. 17 febbraio 2017, n. 42)\"","v":"Corso di n.  ore di aggiornamento professionale per T.C.A. (Decreto Lgs. 17 febbraio 2017, n. 42)"},null,null,null,null,null,null,null,"foglio num.",null,"1 di 2"]
[null,null,{"$f":"ElencoAllievi!$B$8","v":""},null,null,null,{"$f":"ElencoAllievi!$B$4","v":""},null,null,null,"data"]
[null,null,{"$f":" ElencoAllievi!$B$10","v":""},null,null,null,null,null,null,null,"totale ore"]
[null,null,null,null,null,null,null,null,null,null,"totale presenti"]
["N.","Cognome e Nome",null,"N. ENTECA","ora","Firma ENTRATA","ora","Firma USCITA","docente/co-docente/professionista (D/C/P)"]
[1,null,null,null,null,null,null,null,"orario:"]
[2,null,null,null,null,null,null,null,"argomento:"]
[3]
[4]
[5]
[6]
[7,null,null,null,null,null,null,null,"firma _ _ _ _ _ _ _ _ ",null,"firma _ _ _ _ _ _ _ _ "]
[8,null,null,null,null,null,null,null,"orario:"]
[9,null,null,null,null,null,null,null,"argomento:"]
[10]
[11]
[12]
[13,null,null,null,null,null,null,null,"firma _ _ _ _ _ _ _ _ ",null,"firma _ _ _ _ _ _ _ _ "]
[14,null,null,null,null,null,null,null,"orario:"]
[15,null,null,null,null,null,null,null,"argomento:"]
[16]
[17]
[18]
[19,null,null,null,null,null,null,null,"firma _ _ _ _ _ _ _ _ ",null,"firma _ _ _ _ _ _ _ _ "]
[20,null,null,null,null,null,null,null,"orario:"]
[21,null,null,null,null,null,null,null,"argomento:"]
[22]
[23]
[24]
[25,null,null,null,null,null,null,null,"firma _ _ _ _ _ _ _ _ ",null,"firma _ _ _ _ _ _ _ _ "]
{"$rows_left_out":36}